{"text_format":"1","workbook":"xlsx","n_sheets":7,"sheets":["Management Input","Cost Budgets","Financial Analysis","Input Tables","Recommendations","Chemical costs","Growth models"],"not_rendered":{"charts":5,"images":0,"macros":1,"external_links":0,"defined_names":31,"comments":2,"pivot_tables":0},"unopened":[],"bounds":{"document_bytes":16777216,"sheet_cells":100000,"rows_first":2000,"rows_last":500,"rows_between":2000,"halvings":0,"cell_chars":16384,"cell_head_chars":4096},"cells_cut":0,"cells_raw":0,"read":"whole","date_system":"1900"}

{"sheet":"Management Input","index":0,"n_rows":78,"n_cols":20,"rows_kept":78,"cut":false,"hidden":false,"merged":[[5,17,6,19],[32,12,34,19],[11,13,13,18],[20,12,21,19],[20,4,20,5],[11,7,11,9],[15,4,15,5],[7,4,7,5],[19,12,19,19],[31,12,31,14],[31,4,31,5],[25,4,25,6],[33,4,33,6],[24,4,24,5],[23,4,23,6],[11,4,11,5],[0,3,0,19],[2,3,2,4],[2,12,2,16],[3,13,3,14],[3,15,3,17],[1,5,1,14],[3,4,3,6],[10,6,11,6],[17,4,17,6],[5,13,5,15],[9,5,9,8],[20,7,20,10],[13,4,13,6],[19,3,19,5],[29,12,29,14],[24,12,24,14],[29,4,29,5],[27,4,27,6],[30,12,30,14],[25,12,25,14],[26,12,26,14],[27,12,27,14],[28,12,28,14]]}
[null,null,null,"Chestnut Decision Support Tool "]
[null,null,null,null,null,"Version 2.0"]
[null,null,null,"Establishment Decisions: ",null,null,null,null,null,null,null,null,"Harvesting and Marketing Decisions:"]
[null,null,null,"Site Prep:","Herbicide only (1 qt/ac.)",null,null,null,null,null,null,null,null,"Harvest Method:",null,"Nut wizard"]
[]
[null,null,null,"Spacing (Ft):",30,"x",30,null,null,null,null,null,null,"Expected Rate of Return: ",null,null,0.05,"enter a percentage return for this investment"]
[]
[null,null,null,"Layout/Design:","Rectangular/Square",null,null,null,null,null,null,null,null,"Expected Price/lb for nuts",null,null,3]
[]
[null,null,null,"Site Quality:","Good",null,null,null,null,null,null,null,null,"Number of acres in the orchard:",null,null,null,8]
{"$rows_left_out":69}
{"sheet":"Cost Budgets","index":1,"n_rows":104,"n_cols":14,"rows_kept":104,"cut":false,"hidden":false,"merged":[[1,1,1,2],[11,1,11,2],[19,1,19,2],[89,1,89,2],[13,1,13,2],[16,1,16,3],[15,1,15,3],[14,1,14,3],[8,3,8,4],[17,3,17,4],[7,1,7,2],[12,1,12,2],[4,1,4,2],[5,1,5,2]]}
["Establishment Costs:",null,null,null,null,"Cost /acre","Cost/tree"]
["Site Prep",{"$f":"'Management Input'!E4","v":"Herbicide only (1 qt/ac.)"},null,null,null,{"$f":"LOOKUP($B$2,'Input Tables'!$A$2:$A$5,'Input Tables'!B2:B5)","v":120},{"$f":"LOOKUP($B$2,'Input Tables'!$A$2:$A$5,'Input Tables'!C2:C5)","v":2.4793388429752068}]
["Initial # of Stems",{"$f":"'Cost Budgets'!B91","v":48.4}]
["Planting Stock",{"$f":"'Management Input'!E12","v":"Grafted Seedlings"}]
["Graft Technique",{"$f":"'Management Input'!H12","v":"Self Grafted (Field)"},null,null,null,{"$f":"'Cost Budgets'!C95","v":653.4},{"$f":"'Cost Budgets'!B95","v":13.5}]
["Fertilization",{"$f":"'Management Input'!E14","v":"Good early growth (> 8\")"},null,null,null,{"$f":"LOOKUP($B$6,Fert,'Input Tables'!B20:B22)","v":49.368000000000002},{"$f":"LOOKUP($B$6,Fert,'Input Tables'!C20:C22)","v":1.02}]
["Tree Staking",{"$f":"'Management Input'!E16","v":"Steel conduit pipe"},null,null,null,{"$f":"LOOKUP($B$7,'Input Tables'!$A$28:$A$32,'Input Tables'!B28:B32)","v":96.8},{"$f":"LOOKUP($B$7,'Input Tables'!$A$28:$A$32,'Input Tables'!C28:C32)","v":2}]
["Irrigation System",{"$f":"'Management Input'!E18","v":"Drip Irrigation"},null,null,null,{"$f":"LOOKUP(B8,Irrigate,'Input Tables'!B106:B110)","v":445.5}]
[null,null,null,"Subtotal: ",null,{"$f":"SUM(F2:F8)","v":1365.068}]
["Management Costs:"]
{"$rows_left_out":95}
{"sheet":"Financial Analysis","index":2,"n_rows":83,"n_cols":63,"rows_kept":83,"cut":false,"hidden":false,"merged":[[95,10,98,10],[16,0,22,0],[26,4,26,6],[54,0,58,0],[0,0,11,0],[14,0,14,2],[15,0,15,2],[24,0,35,0],[38,0,52,0]]}
["Tree Growth Estimations",null,"Site Index",1,{"$f":"D1+1","v":2},{"$f":"E1+1","v":3},4,5,6,7,8,9,10,11,12,13,14,15,16,17,18,19,20,21,22,23,24,25,26,27,28,29,30,31,32,33,34,35,36,37,38,39,40,41,42,43,44,45,46,47,48,49,50,51,52,53,54,55,56,57,58,59,60]
[null,"Average TC per Stem ",{"$f":"'Management Input'!$E$10","v":"Good"},{"$f":"E2-$I$16","v":0.5},1,1.5,{"$f":"H2-$I$16","v":2},{"$f":"LOOKUP(C2,SI,'Input Tables'!C99:C102)","v":2.5},{"$f":"H2+(H16*H15)","v":3},3.5,4,4.5,5,5.5,6,6.5,7,7.5,8,8.4527724227186773,8.8886574090997819,9.3068302397791296,9.7067450453782733,10.113819169639587,10.503395938474448,10.902207252681492,11.309971719632619,11.702043077003092,12.104633284309825,12.492292759981952,12.891728390528755,13.302219282457045,13.69939766430379,14.108549595367652,14.505069767795534,14.914257458017573,15.311475229204524,15.721858852768426,16.120912711264086,16.533461800679877,{"$f":"AN2+(AN16*AN15)","v":16.935299088939541},17.326315678791062,17.732323872968035,18.128111170349218,18.538805182588153,18.93985664374086,19.331180687227238,19.738424564310154,20.13649601592936,20.55010682650272,20.955083433425138,21.351346933734838,21.763790845640742,22.168038617757848,22.564021275008137,22.97661669270126,23.381443833531559,23.778439516451048,24.192300099439326,24.598807799881346,24.997902505780591,25.413959606944459,25.823066030044853]
[null,null,"Initial Tree Height"]
[null,"Crown Competition Factor",null,{"$f":"((C6*3.14*(2*(D2)+2.436)^2)/44000)*100","v":4.0778255583999998},{"$f":"((D6*3.14*(2*(E2)+2.436)^2)/44000)*100","v":6.7968143583999998},10.2066031584,14.307191958399997,19.098580758399997,24.072902418763636,28.212125436218184,32.176992817309092,35.839050016581815,42.380846089309095,45.605815288581816,52.647042634036367,60.193524524945452,68.245260961309086,76.802251943127274,85.864497470399996,94.506689780882709,103.21797007333477,111.93616513636968,108.54388338950636,116.78363944017399,112.45633262187944,108.21509516754723,115.61901947553399,110.67210898347209,117.67668082641838,112.16212510383757,106.91351031833432,113.22481811988263,107.55334587977802,113.53416775714771,107.5362737171143,113.20629816184484,106.96481438566438,112.34206036247261,105.92757737628756,111.02826768122718,116.11182345309825,109.0509496933507,113.87833329069954,106.8163408154744,111.39963631190209,115.96823378543274,108.4630641606624,112.80470768527557,105.41781478118605,109.54099393147993,113.65473650387842,105.97803227312292,109.88681916449255,113.78661856461214,105.90535066212077,109.61194098214251,113.31070784176012,105.297773951181,108.81342334961741,112.32281226549996,104.24014850296672,107.57507108800071,110.90548161657171]
[null,null,"Initial Density"]
[null,"Stems per Acre",{"$f":"'Cost Budgets'!B3","v":48.4},{"$f":"C6","v":48.4},{"$f":"D6-E10","v":48.4},{"$f":"E6-F10","v":48.4},48.4,{"$f":"G6-(G8+H10)","v":47.4},44.4,41.4,38.4,38.4,35.4,35.4,35.4,35.4,35.4,35.4,35.4,35.4,35.4,31.86,31.86,28.673999999999999,25.8066,25.8066,23.225940000000001,23.225940000000001,20.903346000000003,18.813011400000001,18.813011400000001,16.931710259999999,16.931710259999999,15.238539233999999,15.238539233999999,13.7146853106,13.7146853106,12.343216779540001,12.343216779540001,12.343216779540001,11.108895101586,11.108895101586,9.9980055914274004,9.9980055914274004,9.9980055914274004,8.9982050322846607,8.9982050322846607,8.0983845290561938,8.0983845290561938,8.0983845290561938,7.288546076150574,7.288546076150574,7.288546076150574,6.559691468535517,6.559691468535517,6.559691468535517,5.9037223216819648,5.9037223216819648,5.9037223216819648,5.3133500895137686,5.3133500895137686,5.3133500895137686,5.3133500895137686]
[]
[null,"Mortality Loss (1st 10 years)",0.08,{"$f":"IF(D1<10,RANDBETWEEN(0,($C$8*C6)),0)","v":3},0,3,1,3,3,3,0,3,0,0,0,0,0,0,0,0,0,0,0,0,0,0,0,0,0,0,0,0,0,0,0,{"$f":"IF(AJ1<10,RANDBETWEEN(0,($C$8*AI6)),0)","v":0},0,0,0,0,0,0,0,0,0,0,0,0,0,0,0,0,0,0,0,0,0,0,0,0,0,0,0]
[null,null,"Removal %"]
[null,"Thinnings (# of stems removed)",{"$f":"'Management Input'!E21","v":0.1},{"$f":"IF(D15>0.8,0,(D6*($C$10)))","v":0},{"$f":"IF(E15>0.8,0,((D6-D8)*($C$10)))","v":0},0,0,0,0,0,0,0,0,0,0,0,0,0,0,0,0,3.54,0,3.1859999999999999,2.8673999999999999,0,2.58066,0,2.322594,2.0903346000000003,0,1.8813011400000001,0,1.6931710259999999,0,1.5238539233999999,{"$f":"IF(AK15>0.8,0,((AJ6-AJ8)*($C$10)))","v":0},1.3714685310600001,0,0,1.2343216779540001,0,1.1108895101586,0,0,0.99980055914274013,0,0.89982050322846607,0,0,0.8098384529056194,0,0,0.72885460761505749,0,0,0.65596914685355179,0,0,0.59037223216819645,0,0,0]
{"$rows_left_out":74}
{"sheet":"Input Tables","index":3,"n_rows":110,"n_cols":91,"rows_kept":110,"cut":false,"hidden":false,"merged":[[76,4,76,5],[86,3,86,5],[86,7,86,8],[74,3,74,10],[68,4,68,5],[45,3,45,10],[41,4,41,5],[93,8,93,9],[92,12,92,14],[92,16,92,17],[93,12,93,14],[93,16,93,17],[88,3,88,5],[88,7,88,8],[53,3,53,5],[53,7,53,8],[67,3,67,5],[67,7,67,8],[75,3,75,5],[75,7,75,8],[83,3,83,10],[0,3,0,10],[6,3,6,10],[11,3,11,10],[18,3,18,10],[23,3,23,10],[8,4,8,5],[104,4,105,4],[24,5,24,7],[66,3,66,10],[26,3,26,10],[33,3,33,10],[39,3,39,10],[35,4,35,5],[47,4,47,5],[54,4,54,5],[34,3,34,5],[40,3,40,5],[52,3,52,10],[40,7,40,8],[46,3,46,5],[46,7,46,8],[34,7,34,8]]}
["Site Prep","Estimated Cost/ac","Cost per Tree","Occurrence"]
["Discing only",100,{"$f":"B2/'Cost Budgets'!$B$3","v":2.0661157024793391},1]
["Herbicide only (1 qt/ac.)",120,{"$f":"B3/'Cost Budgets'!$B$3","v":2.4793388429752068},1]
["Herbicide with Discing",150,{"$f":"B4/'Cost Budgets'!$B$3","v":3.0991735537190084},1]
["User Defined",0,0]
[]
["Layout/Design","Estimated Cost/ac","Cost per Tree","Occurrence"]
["Diamond"]
["Hexagonal",null,null,null,"No Cost "]
["Rectangular/Square"]
{"$rows_left_out":101}
{"sheet":"Recommendations","index":4,"n_rows":74,"n_cols":16,"rows_kept":74,"cut":false,"hidden":true,"merged":[[184,0,209,14],[212,0,222,14],[0,0,0,14],[88,0,88,14],[89,0,99,14],[102,0,106,14],[1,0,2,14],[109,0,118,14],[121,0,138,9],[139,0,143,9],[146,0,158,9],[174,0,181,14],[19,0,60,14],[4,0,16,14],[63,0,85,14]]}
["RECOMMENDATIONS FOR CHINESE CHESTNUT MANAGEMENT"]
["All recommendations on this page are taken directly from:  Hunt, K., M. Gold, W. Reid, and M.Warmund. 2009. Growing Chinese Chestnut in Missouri.  Agroforestry in Action, AF1007-2008, University of Missouri Center for Agroforestry.  "]
[]
[]
["Site Selection\nChinese chestnut trees perform best in well-drained, loamy to sandy loam soils.  Heavy, poorly-drained soils, or soils that have a perched water table during wet seasons promote Phytophthora root rot, a devastating disease of chestnuts. Soils should be slightly acid (pH 5.5-6.5).  Most Chinese chestnuts can tolerate –20⁰ F temperatures when fully dormant, but it is strongly recommended that frost pockets be avoided as planting sites, to avoid injury to swelling buds in the spring. Site selection similar to the requirements for peaches, where summit and shoulder slopes are chosen to allow for good air drainage, would be the best choice to safeguard from winter and late spring frost injury.  Chinese chestnut trees are rather drought tolerant once established, but ample water throughout the growing season promotes good tree growth and regular nut production. Maximum chestnut yields and nut size are obtained only under optimum soil water conditions, therefore irrigation is recommended. A lack of water during mid-August will result in smaller nut size, while a lack of water in September can prevent burrs from opening normally. Micro-irrigation techniques (drip and/or micro-sprinklers) are best suited for chestnut orchards.\n\n"]
[]
[]
[]
[null,null,null,null,null,null,null,null,null,null,null,null,null,null,null,"Management Input'!A1"]
[]
{"$rows_left_out":65}
{"sheet":"Chemical costs","index":5,"n_rows":16,"n_cols":85,"rows_kept":16,"cut":false,"hidden":false,"merged":[]}
["Name","Low App Rate/ac","Hi App Rate/ac","Ave Rate","unit","cost ","unit","cost/acre",null,null,null,null,null,null,null,null,null,null,null,null,null,null,null,null,null,null,null,null,null,null,null,null,null,null,null,null,null,null,null,null,null,null,null,null,null,null,null,null,null,null,null,null,null,null,null,null,null,null,null,null,null,null,null,null,null,null,null,null,null,null,null,null,null,null,null,null,null,null,null,null,null,"oz","pt","qt","gal"]
["Asana XL",4.8,14.5,{"$f":"AVERAGE(B2:C2)","v":9.65},"oz",108.02,"gal",{"$f":"D2*(HLOOKUP(E2,$CD$1:$CG$5,IF(G2=\"oz\", 2, IF(G2=\"pt\",3, IF(G2=\"qt\", 4,5)))))*F2","v":8.1442165089999996},null,null,null,null,null,null,null,null,null,null,null,null,null,null,null,null,null,null,null,null,null,null,null,null,null,null,null,null,null,null,null,null,null,null,null,null,null,null,null,null,null,null,null,null,null,null,null,null,null,null,null,null,null,null,null,null,null,null,null,null,null,null,null,null,null,null,null,null,null,null,null,null,"oz",1,16,32,128]
["Confirm 2F",8,16,{"$f":"AVERAGE(B3:C3)","v":12},"oz",null,null,{"$f":"D3*(HLOOKUP(E3,$CD$1:$CG$5,IF(G3=\"oz\", 2, IF(G3=\"pt\",3, IF(G3=\"qt\", 4,5)))))*F3","v":0},null,null,null,null,null,null,null,null,null,null,null,null,null,null,null,null,null,null,null,null,null,null,null,null,null,null,null,null,null,null,null,null,null,null,null,null,null,null,null,null,null,null,null,null,null,null,null,null,null,null,null,null,null,null,null,null,null,null,null,null,null,null,null,null,null,null,null,null,null,null,null,null,"pt",6.25E-2,1,2,8]
["Lorsban 4E/Nufos 4E",1.4,5,3.2,"pt",41.14,"gal",16.456,null,null,null,null,null,null,null,null,null,null,null,null,null,null,null,null,null,null,null,null,null,null,null,null,null,null,null,null,null,null,null,null,null,null,null,null,null,null,null,null,null,null,null,null,null,null,null,null,null,null,null,null,null,null,null,null,null,null,null,null,null,null,null,null,null,null,null,null,null,null,null,null,"qt",3.1199999999999999E-2,0.5,1,4]
["Warrior",2.56,5.12,3.84,"oz",2.4500000000000002,"oz",9.4079999999999995,null,null,null,null,null,null,null,null,null,null,null,null,null,null,null,null,null,null,null,null,null,null,null,null,null,null,null,null,null,null,null,null,null,null,null,null,null,null,null,null,null,null,null,null,null,null,null,null,null,null,null,null,null,null,null,null,null,null,null,null,null,null,null,null,null,null,null,null,null,null,null,null,"gal",7.8130000000000005E-3,0.125,0.25,1]
["Imidian 70WSB",1,3.125,2.0625,"pt",9.81,"pt",{"$f":"D6*F6","v":20.233125000000001}]
["Sevin 80W",2.5,6.25,4.375,"pt",7.83,"pt",{"$f":"D7*F7","v":34.256250000000001}]
["Dipel ES",1,4,2.5,"pt",13.2,"pt",33]
["Javelin WG",0.25,4,2.125,"pt",null,null,0]
["Guthion 2L",6,8,7,"pt",12.76,"pt",89.32,null,null,null,null,null,null,null,null,null,null,null,null,null,null,null,null,null,null,null,null,null,null,null,null,null,null,null,null,null,null,null,null,null,null,null,null,null,null,null,null,null,null,null,null,null,null,null,null,null,null,null,null,null,null,null,null,null,null,null,null,null,null,null,null,null,null,null,null,null,null,null,null,null,"this is read:  Vertical/horizontal"]
{"$rows_left_out":7}
{"sheet":"Growth models","index":6,"n_rows":94,"n_cols":71,"rows_kept":94,"cut":false,"hidden":false,"merged":[]}
[]
["Age",1,{"$f":"B2+1","v":2},{"$f":"C2+1","v":3},4,5,6,7,8,9,10,11,12,13,14,15,16,17,18,19,20,21,22,23,24,25,26,27,28,29,30,31,32,33,34,35,36,37,38,39,40,41,42,43,44,45,46,47,48,49,50,51,52,53,54,55,56,57,58,{"$f":"BG2+1","v":59},60]
["TC",{"$f":"'Financial Analysis'!D2","v":0.5},{"$f":"'Financial Analysis'!E2","v":1},{"$f":"'Financial Analysis'!F2","v":1.5},{"$f":"'Financial Analysis'!G2","v":2},{"$f":"'Financial Analysis'!H2","v":2.5},{"$f":"'Financial Analysis'!I2","v":3},{"$f":"'Financial Analysis'!J2","v":3.5},{"$f":"'Financial Analysis'!K2","v":4},{"$f":"'Financial Analysis'!L2","v":4.5},{"$f":"'Financial Analysis'!M2","v":5},{"$f":"'Financial Analysis'!N2","v":5.5},{"$f":"'Financial Analysis'!O2","v":6},{"$f":"'Financial Analysis'!P2","v":6.5},{"$f":"'Financial Analysis'!Q2","v":7},{"$f":"'Financial Analysis'!R2","v":7.5},{"$f":"'Financial Analysis'!S2","v":8},{"$f":"'Financial Analysis'!T2","v":8.4527724227186773},{"$f":"'Financial Analysis'!U2","v":8.8886574090997819},{"$f":"'Financial Analysis'!V2","v":9.3068302397791296},{"$f":"'Financial Analysis'!W2","v":9.7067450453782733},{"$f":"'Financial Analysis'!X2","v":10.113819169639587},{"$f":"'Financial Analysis'!Y2","v":10.503395938474448},{"$f":"'Financial Analysis'!Z2","v":10.902207252681492},{"$f":"'Financial Analysis'!AA2","v":11.309971719632619},{"$f":"'Financial Analysis'!AB2","v":11.702043077003092},{"$f":"'Financial Analysis'!AC2","v":12.104633284309825},{"$f":"'Financial Analysis'!AD2","v":12.492292759981952},{"$f":"'Financial Analysis'!AE2","v":12.891728390528755},{"$f":"'Financial Analysis'!AF2","v":13.302219282457045},{"$f":"'Financial Analysis'!AG2","v":13.69939766430379},{"$f":"'Financial Analysis'!AH2","v":14.108549595367652},{"$f":"'Financial Analysis'!AI2","v":14.505069767795534},{"$f":"'Financial Analysis'!AJ2","v":14.914257458017573},{"$f":"'Financial Analysis'!AK2","v":15.311475229204524},{"$f":"'Financial Analysis'!AL2","v":15.721858852768426},{"$f":"'Financial Analysis'!AM2","v":16.120912711264086},{"$f":"'Financial Analysis'!AN2","v":16.533461800679877},{"$f":"'Financial Analysis'!AO2","v":16.935299088939541},{"$f":"'Financial Analysis'!AP2","v":17.326315678791062},{"$f":"'Financial Analysis'!AQ2","v":17.732323872968035},{"$f":"'Financial Analysis'!AR2","v":18.128111170349218},{"$f":"'Financial Analysis'!AS2","v":18.538805182588153},{"$f":"'Financial Analysis'!AT2","v":18.93985664374086},{"$f":"'Financial Analysis'!AU2","v":19.331180687227238},{"$f":"'Financial Analysis'!AV2","v":19.738424564310154},{"$f":"'Financial Analysis'!AW2","v":20.13649601592936},{"$f":"'Financial Analysis'!AX2","v":20.55010682650272},{"$f":"'Financial Analysis'!AY2","v":20.955083433425138},{"$f":"'Financial Analysis'!AZ2","v":21.351346933734838},{"$f":"'Financial Analysis'!BA2","v":21.763790845640742},{"$f":"'Financial Analysis'!BB2","v":22.168038617757848},{"$f":"'Financial Analysis'!BC2","v":22.564021275008137},{"$f":"'Financial Analysis'!BD2","v":22.97661669270126},{"$f":"'Financial Analysis'!BE2","v":23.381443833531559},{"$f":"'Financial Analysis'!BF2","v":23.778439516451048},{"$f":"'Financial Analysis'!BG2","v":24.192300099439326},{"$f":"'Financial Analysis'!BH2","v":24.598807799881346},{"$f":"'Financial Analysis'!BI2","v":24.997902505780591},{"$f":"'Financial Analysis'!BJ2","v":25.413959606944459},{"$f":"'Financial Analysis'!BK2","v":25.823066030044853}]
["Nut yield (good)",{"$f":"0.0016*(B2^3)-0.2308*(B2^2)+10.338*B2-22.378","v":-12.269200000000001},{"$f":"0.0016*(C2^3)-0.2308*(C2^2)+10.338*C2-22.378","v":-2.6124000000000009},6.6019999999999968,15.383599999999994,23.741999999999997,31.686799999999991,39.227599999999995,46.373999999999995,53.135599999999982,59.521999999999991,65.542799999999986,71.207599999999985,76.525999999999968,81.507599999999996,86.161999999999992,90.498799999999989,94.527599999999978,98.257999999999967,101.6996,104.86199999999998,107.75479999999997,110.38759999999998,112.76999999999997,114.91159999999998,116.82199999999999,118.51079999999995,119.98759999999997,121.26199999999999,122.34359999999997,123.242,123.96679999999996,124.52759999999996,124.93399999999998,125.19559999999997,125.32199999999999,125.32279999999996,125.2076,124.98600000000003,124.66759999999998,124.26199999999999,123.77879999999992,123.22759999999992,122.61799999999998,121.95959999999995,121.26199999999999,120.5348,119.78759999999998,119.02999999999996,118.27159999999996,117.52199999999998,116.79079999999998,116.08759999999988,115.42199999999995,114.8036,114.24199999999995,113.74679999999999,113.3276,112.99399999999996,112.7556,112.622]
["Nut yield (Average)",{"$f":"0.0012*(B2^3)-0.1701*(B2^2)+7.4625*(B2)-14.91","v":-7.6163999999999996},{"$f":"0.0012*(C2^3)-0.1701*(C2^2)+7.4625*(C2)-14.91","v":-0.65579999999999927},5.9790000000000028,12.295200000000001,18.3,24.000600000000002,29.404200000000007,34.518000000000001,39.34920000000001,43.905000000000001,48.192600000000013,52.219200000000015,55.992000000000004,59.518200000000007,62.805000000000007,65.8596,68.689200000000014,71.301000000000016,73.702199999999991,75.900000000000006,77.901600000000002,79.714200000000005,81.345000000000013,82.801200000000023,84.09,85.218600000000009,86.194200000000023,87.024000000000029,87.71520000000001,88.275000000000006,88.710599999999999,89.029200000000003,89.238,89.344200000000001,89.35499999999999,89.277600000000035,89.119200000000006,88.886999999999972,88.588200000000001,88.22999999999999,87.819600000000008,87.364200000000011,86.870999999999952,86.347200000000015,85.800000000000011,85.236600000000038,84.664200000000022,84.09000000000006,83.521199999999993,82.965000000000003,82.428600000000046,81.919199999999961,81.444000000000045,81.010200000000026,80.624999999999972,80.295600000000064,80.029199999999975,79.832999999999998,79.714199999999977,79.679999999999978]
["Nut yield (Fair)",{"$f":"0.0007*(B2^3)-0.095*(B2^2)+4.1643*(B2)-9.7368","v":-5.6668000000000003},{"$f":"0.0007*(C2^3)-0.095*(C2^2)+4.1643*(C2)-9.7368","v":-1.7826000000000004},1.9199999999999982,5.445199999999998,8.7971999999999984,11.980199999999998,14.998399999999998,17.855999999999995,20.557199999999995,23.106200000000001,25.507199999999997,27.764399999999995,29.881999999999998,31.864199999999997,33.715199999999996,35.4392,37.040399999999991,38.522999999999989,39.891199999999998,41.1492,42.301199999999994,43.351399999999991,44.303999999999988,45.163199999999989,45.933199999999999,46.618200000000002,47.2224,47.749999999999986,48.205199999999991,48.592200000000005,48.915199999999999,49.178399999999996,49.385999999999996,49.54219999999998,49.651199999999989,49.717199999999977,49.74439999999997,49.737000000000009,49.699200000000005,49.635199999999998,49.549199999999999,49.445399999999992,49.327999999999989,49.201199999999972,49.069199999999981,48.936199999999971,48.806399999999982,48.683999999999983,48.5732,48.478200000000001,48.403199999999984,48.352400000000003,48.32999999999997,48.340200000000024,48.387199999999993,48.475199999999958,48.608399999999946,48.790999999999983,49.027200000000008,49.32119999999999]
["Nut yield (Poor)",{"$f":"0.0003*(B2^3)-0.0471*(B2^2)+2.1122*(B2)-6.0816","v":-4.0161999999999995},-2.0431999999999997,-0.16079999999999917,1.6328000000000005,3.3393999999999995,4.9608000000000008,6.498800000000001,7.9551999999999996,9.331800000000003,10.6304,11.8528,13.0008,14.076200000000002,15.080800000000002,16.016399999999997,16.884799999999998,17.687800000000003,18.427199999999999,19.104799999999997,19.7224,20.281799999999997,20.784799999999997,21.233200000000004,21.628799999999998,21.973399999999998,22.268799999999999,{"$f":"0.0003*(AB2^3)-0.0471*(AB2^2)+2.1122*(AB2)-6.0816","v":22.516799999999996},{"$f":"0.0003*(AC2^3)-0.0471*(AC2^2)+2.1122*(AC2)-6.0816","v":22.719200000000001},22.877800000000001,22.994399999999999,23.070799999999998,23.108799999999995,23.110199999999999,23.076799999999999,23.010399999999997,22.912800000000004,22.785800000000002,22.631199999999993,22.450799999999994,22.246400000000001,22.019799999999996,21.772799999999997,21.50719999999999,21.224799999999995,20.927399999999984,20.616800000000005,20.294800000000002,19.963199999999993,19.623799999999981,19.278399999999984,18.928799999999988,18.576799999999984,18.224199999999989,17.872799999999991,17.524399999999979,17.180799999999998,16.84379999999998,16.5152,16.196799999999975,15.890399999999994]
[]
[]
[]
{"$rows_left_out":84}