{"text_format":"1","workbook":"xlsx","n_sheets":6,"sheets":["Management Input","Input Tables","Cost Budgets","Financial Analysis","Chemical costs","Nut Price"],"not_rendered":{"charts":0,"images":0,"macros":1,"external_links":0,"defined_names":29,"comments":1,"pivot_tables":0},"unopened":[],"bounds":{"document_bytes":16777216,"sheet_cells":100000,"rows_first":2000,"rows_last":500,"rows_between":2000,"halvings":0,"cell_chars":16384,"cell_head_chars":4096},"cells_cut":0,"cells_raw":0,"read":"whole","date_system":"1900"}

{"sheet":"Management Input","index":0,"n_rows":77,"n_cols":18,"rows_kept":77,"cut":false,"hidden":false,"merged":[[29,7,29,10],[30,7,30,10],[25,7,25,10],[31,7,31,10],[32,7,32,10],[24,14,24,16],[26,14,26,16],[27,14,27,16],[28,14,28,16],[31,14,31,16],[26,7,26,10],[27,7,27,10],[28,7,28,10],[13,2,13,4],[19,4,20,5],[19,7,19,17],[20,7,22,17],[24,7,24,10],[17,11,17,13],[5,6,6,7],[15,15,16,17],[13,13,13,14],[13,15,14,17],[11,13,11,14],[9,13,9,15],[5,11,5,12],[13,11,13,12],[15,11,15,13],[9,3,9,6],[19,1,19,3],[20,2,20,3],[11,5,11,7],[15,2,15,3],[5,13,5,14],[7,11,7,12],[7,13,7,14],[7,2,7,3],[11,11,11,12],[9,11,9,12],[0,1,0,17],[2,1,2,2],[2,10,2,14],[3,11,3,12],[3,13,3,15],[1,3,1,14],[30,2,30,3],[24,2,24,4],[32,2,32,4],[3,2,3,4],[23,2,23,3],[22,2,22,4],[11,2,11,3],[10,4,11,4],[28,2,28,3],[26,2,26,4]]}
[null,"Black Walnut Economic Model for Nut Production "]
[null,null,null,"Version 2.1"]
[null,"Establishment Decisions: ",null,null,null,null,null,null,null,null,"Harvesting and Marketing Decisions:"]
[null,"Site Prep:","Herbicide only (1 qt/ac.)",null,null,null,null,null,null,null,null,"Harvest Method:",null,"Hand pickup"]
[]
[null,"Spacing (Ft):",42,"x",42,null,"UMCA Black Walnut Guide",null,null,null,null,"Percent Nutmeat:",null,0.16]
[]
[null,"Layout/Design:","Rectangular/Square",null,null,null,null,null,null,null,null,"Nutmeat Grade:",null,"Grade 4",null,null,"Standards"]
[]
[null,"Site Index:",80,"   (Average tree height in feet 50 years after planting)",null,null,null,null,null,null,null,"Hulling Method:",null,"Manual (improvised)"]
{"$rows_left_out":68}
{"sheet":"Input Tables","index":1,"n_rows":131,"n_cols":91,"rows_kept":131,"cut":false,"hidden":false,"merged":[[86,3,86,5],[106,8,106,9],[88,3,88,5],[88,7,88,8],[53,3,53,5],[53,7,53,8],[67,3,67,5],[67,7,67,8],[75,3,75,5],[75,7,75,8],[83,3,83,10],[99,12,99,14],[99,16,99,17],[100,12,100,14],[100,16,100,17],[40,7,40,8],[86,7,86,8],[74,3,74,10],[68,4,68,5],[76,4,76,5],[100,8,100,9],[0,3,0,10],[6,3,6,10],[11,3,11,10],[18,3,18,10],[23,3,23,10],[8,4,8,5],[52,3,52,10],[46,3,46,5],[46,7,46,8],[34,7,34,8],[45,3,45,10],[41,4,41,5],[24,5,24,7],[66,3,66,10],[26,3,26,10],[33,3,33,10],[39,3,39,10],[35,4,35,5],[47,4,47,5],[54,4,54,5],[34,3,34,5],[40,3,40,5]]}
["Site Prep","Estimated Cost/ac","Cost per Tree","Occurrence"]
["Discing only",10,{"$f":"B2/'Cost Budgets'!$C$3","v":0.40495867768595045},1]
["Herbicide only (1 qt/ac.)",13,{"$f":"B3/'Cost Budgets'!$C$3","v":0.52644628099173552},1]
["Herbicide with Discing",23,{"$f":"B4/'Cost Budgets'!$C$3","v":0.93140495867768602},1]
["User Defined",0,0]
[]
["Layout/Design","Estimated Cost/ac","Cost per Tree","Occurrence"]
["Diamond"]
["Hexagonal",null,null,null,"No Cost "]
["Rectangular/Square"]
{"$rows_left_out":122}
{"sheet":"Cost Budgets","index":2,"n_rows":110,"n_cols":15,"rows_kept":110,"cut":false,"hidden":false,"merged":[[19,2,19,3],[20,2,20,3],[95,2,95,3],[12,2,12,3],[15,2,15,4],[14,2,14,4],[13,2,13,4],[11,2,11,3],[4,2,4,3],[5,2,5,3],[1,2,1,3],[10,2,10,3],[18,2,18,3]]}
[null,"Establishment Costs:",null,null,null,null,"Cost /acre","Cost/tree","Total Cost"]
[null,"Site Prep",{"$f":"'Management Input'!C4","v":"Herbicide only (1 qt/ac.)"},null,null,null,{"$f":"LOOKUP($C$2,'Input Tables'!$A$2:$A$5,'Input Tables'!B2:B5)","v":13},{"$f":"LOOKUP($C$2,'Input Tables'!$A$2:$A$5,'Input Tables'!C2:C5)","v":0.52644628099173552},{"$f":"G2*'Management Input'!O18","v":130}]
[null,"Initial # of Stems",{"$f":"'Cost Budgets'!C97","v":24.693877551020407},null,null,null,null,null,{"$f":"C3*'Management Input'!O18","v":246.93877551020407}]
[null,"Planting Stock",{"$f":"'Management Input'!C12","v":"Grafted Seedlings"}]
[null,"Graft Technique",{"$f":"'Management Input'!F12","v":"Nursery Grafted"},null,null,null,{"$f":"'Cost Budgets'!D101","v":555.61224489795916},{"$f":"'Cost Budgets'!C101","v":22.5},{"$f":"G5*'Management Input'!$O$18","v":5556.1224489795914}]
[null,"Fertilization",{"$f":"'Management Input'!C14","v":"Good early growth (> 8\")"},null,null,null,{"$f":"LOOKUP($C$6,Fert,'Input Tables'!B20:B22)","v":25.187755102040814},{"$f":"LOOKUP($C$6,Fert,'Input Tables'!C20:C22)","v":1.02},{"$f":"G6*'Management Input'!$O$18","v":251.87755102040813}]
[null,"Tree Staking",{"$f":"'Management Input'!C16","v":"User Defined"},null,null,null,{"$f":"LOOKUP($C$7,'Input Tables'!$A$28:$A$32,'Input Tables'!B28:B32)","v":0},{"$f":"LOOKUP($C$7,'Input Tables'!$A$28:$A$32,'Input Tables'!C28:C32)","v":0},{"$f":"G7*'Management Input'!$O$18","v":0}]
[]
[null,"Management Costs:"]
[null,"Thinning",{"$f":"'Management Input'!C21","v":0.5}]
{"$rows_left_out":101}
{"sheet":"Financial Analysis","index":3,"n_rows":132,"n_cols":73,"rows_kept":132,"cut":false,"hidden":false,"merged":[[125,10,128,10],[67,0,84,0],[110,1,112,1],[29,0,35,0],[39,4,39,6],[27,0,27,2],[28,0,28,2],[37,0,46,0],[49,0,63,0],[0,0,24,0],[125,9,128,9]]}
["Tree Growth Estimations",null,"Site Index",1,{"$f":"D1+1","v":2},{"$f":"E1+1","v":3},4,5,6,7,8,9,10,11,12,13,14,15,16,17,18,19,20,21,22,23,24,25,26,27,28,29,30,31,32,33,34,35,36,37,38,39,40,41,42,43,44,45,46,47,48,49,50,51,52,53,54,55,56,57,58,59,60,61,62,63,64,65,66,{"$f":"BQ1+1","v":67},{"$f":"BR1+1","v":68},{"$f":"BS1+1","v":69},{"$f":"BT1+1","v":70}]
[null,"DBH per Stem ",70,{"$f":"E2-$I$29","v":0.875},{"$f":"F2-$I$29","v":1.3125},{"$f":"G2-$I$29","v":1.75},{"$f":"H2-$I$29","v":2.1875},{"$f":"LOOKUP(C2,SI,'Input Tables'!C116:C131)","v":2.625},{"$f":"H2+(H29*H28)","v":3.0625},{"$f":"I2+(I29*I28)","v":3.5},3.9375,4.375,4.8125,5.25,5.6875,6.125,6.5625,7,7.4375,7.875,8.3125,8.75,9.1875,9.5792597418169372,9.9549746642328767,10.313649825706818,10.654567169456275,11.092067169456275,11.529567169456275,11.967067169456275,12.404567169456275,12.842067169456275,13.279567169456275,13.717067169456275,14.116463699116705,14.505142354688918,14.88250003916667,15.248037433789577,15.601353491375733,15.942140004767275,16.379640004767275,16.817140004767275,17.254640004767275,17.692140004767275,18.129640004767275,18.567140004767275,19.004640004767275,19.442140004767275,19.879640004767275,20.317140004767275,20.718225151453058,21.11190650657479,21.497862332269651,21.875808505672918,22.245497073207844,22.606714845042152,22.95928201139742,23.303050766093691,23.740550766093691,24.178050766093691,24.615550766093691,25.053050766093691,25.490550766093691,25.928050766093691,26.365550766093691,26.803050766093691,27.240550766093691,27.678050766093691,28.115550766093691,28.553050766093691,28.990550766093691,29.428050766093691,29.833063229289078]
[null,null,"Initial Tree Height"]
[null,"Tree Height",{"$f":"IF('Management Input'!C12=\"Seed\", 0,IF('Management Input'!C12=\"Seedlings (bare root)\", 1.5,2.5))","v":2.5},{"$f":"C4","v":2.5},{"$f":"D4+(('Management Input'!$C$10-$D$4)/50)","v":4.05},{"$f":"E4+(('Management Input'!$C$10-$D$4)/50)","v":5.6},{"$f":"F4+(('Management Input'!$C$10-$D$4)/50)","v":7.1499999999999995},{"$f":"G4+(('Management Input'!$C$10-$D$4)/50)","v":8.6999999999999993},{"$f":"H4+(('Management Input'!$C$10-$D$4)/50)","v":10.25},{"$f":"I4+(('Management Input'!$C$10-$D$4)/50)","v":11.8},{"$f":"J4+(('Management Input'!$C$10-$D$4)/50)","v":13.350000000000001},{"$f":"K4+(('Management Input'!$C$10-$D$4)/50)","v":14.900000000000002},{"$f":"L4+(('Management Input'!$C$10-$D$4)/50)","v":16.450000000000003},{"$f":"M4+(('Management Input'!$C$10-$D$4)/50)","v":18.000000000000004},{"$f":"N4+(('Management Input'!$C$10-$D$4)/50)","v":19.550000000000004},{"$f":"O4+(('Management Input'!$C$10-$D$4)/50)","v":21.100000000000005},{"$f":"P4+(('Management Input'!$C$10-$D$4)/50)","v":22.650000000000006},{"$f":"Q4+(('Management Input'!$C$10-$D$4)/50)","v":24.200000000000006},{"$f":"R4+(('Management Input'!$C$10-$D$4)/50)","v":25.750000000000007},{"$f":"S4+(('Management Input'!$C$10-$D$4)/50)","v":27.300000000000008},{"$f":"T4+(('Management Input'!$C$10-$D$4)/50)","v":28.850000000000009},{"$f":"U4+(('Management Input'!$C$10-$D$4)/50)","v":30.400000000000009},{"$f":"V4+(('Management Input'!$C$10-$D$4)/50)","v":31.95000000000001},{"$f":"W4+(('Management Input'!$C$10-$D$4)/50)","v":33.500000000000007},{"$f":"X4+(('Management Input'!$C$10-$D$4)/50)","v":35.050000000000004},{"$f":"Y4+(('Management Input'!$C$10-$D$4)/50)","v":36.6},{"$f":"Z4+(('Management Input'!$C$10-$D$4)/50)","v":38.15},{"$f":"AA4+(('Management Input'!$C$10-$D$4)/50)","v":39.699999999999996},{"$f":"AB4+(('Management Input'!$C$10-$D$4)/50)","v":41.249999999999993},{"$f":"AC4+(('Management Input'!$C$10-$D$4)/50)","v":42.79999999999999},{"$f":"AD4+(('Management Input'!$C$10-$D$4)/50)","v":44.349999999999987},{"$f":"AE4+(('Management Input'!$C$10-$D$4)/50)","v":45.899999999999984},{"$f":"AF4+(('Management Input'!$C$10-$D$4)/50)","v":47.449999999999982},{"$f":"AG4+(('Management Input'!$C$10-$D$4)/50)","v":48.999999999999979},{"$f":"AH4+(('Management Input'!$C$10-$D$4)/50)","v":50.549999999999976},{"$f":"AI4+(('Management Input'!$C$10-$D$4)/50)","v":52.099999999999973},{"$f":"AJ4+(('Management Input'!$C$10-$D$4)/50)","v":53.64999999999997},{"$f":"AK4+(('Management Input'!$C$10-$D$4)/50)","v":55.199999999999967},{"$f":"AL4+(('Management Input'!$C$10-$D$4)/50)","v":56.749999999999964},{"$f":"AM4+(('Management Input'!$C$10-$D$4)/50)","v":58.299999999999962},{"$f":"AN4+(('Management Input'!$C$10-$D$4)/50)","v":59.849999999999959},{"$f":"AO4+(('Management Input'!$C$10-$D$4)/50)","v":61.399999999999956},{"$f":"AP4+(('Management Input'!$C$10-$D$4)/50)","v":62.949999999999953},{"$f":"AQ4+(('Management Input'!$C$10-$D$4)/50)","v":64.499999999999957},{"$f":"AR4+(('Management Input'!$C$10-$D$4)/50)","v":66.049999999999955},{"$f":"AS4+(('Management Input'!$C$10-$D$4)/50)","v":67.599999999999952},{"$f":"AT4+(('Management Input'!$C$10-$D$4)/50)","v":69.149999999999949},{"$f":"AU4+(('Management Input'!$C$10-$D$4)/50)","v":70.699999999999946},{"$f":"AV4+(('Management Input'!$C$10-$D$4)/50)","v":72.249999999999943},{"$f":"AW4+(('Management Input'!$C$10-$D$4)/50)","v":73.79999999999994},{"$f":"AX4+(('Management Input'!$C$10-$D$4)/50)","v":75.349999999999937},{"$f":"AY4+(('Management Input'!$C$10-$D$4)/50)","v":76.899999999999935},{"$f":"AZ4+(('Management Input'!$C$10-$D$4)/50)","v":78.449999999999932},{"$f":"BA4+(('Management Input'!$C$10-$D$4)/50)","v":79.999999999999929},{"$f":"BB4+(('Management Input'!$C$10-$D$4)/50)","v":81.549999999999926},{"$f":"BC4+(('Management Input'!$C$10-$D$4)/50)","v":83.099999999999923},{"$f":"BD4+(('Management Input'!$C$10-$D$4)/50)","v":84.64999999999992},{"$f":"BE4+(('Management Input'!$C$10-$D$4)/50)","v":86.199999999999918},{"$f":"BF4+(('Management Input'!$C$10-$D$4)/50)","v":87.749999999999915},{"$f":"BG4+(('Management Input'!$C$10-$D$4)/50)","v":89.299999999999912},{"$f":"BH4+(('Management Input'!$C$10-$D$4)/50)","v":90.849999999999909},{"$f":"BI4+(('Management Input'!$C$10-$D$4)/50)","v":92.399999999999906},{"$f":"BJ4+(('Management Input'!$C$10-$D$4)/50)","v":93.949999999999903},{"$f":"BK4+(('Management Input'!$C$10-$D$4)/50)","v":95.499999999999901},{"$f":"BL4+(('Management Input'!$C$10-$D$4)/50)","v":97.049999999999898},{"$f":"BM4+(('Management Input'!$C$10-$D$4)/50)","v":98.599999999999895},{"$f":"BN4+(('Management Input'!$C$10-$D$4)/50)","v":100.14999999999989},{"$f":"BO4+(('Management Input'!$C$10-$D$4)/50)","v":101.69999999999989},{"$f":"BP4+(('Management Input'!$C$10-$D$4)/50)","v":103.24999999999989},{"$f":"BQ4+(('Management Input'!$C$10-$D$4)/50)","v":104.79999999999988},{"$f":"BR4+(('Management Input'!$C$10-$D$4)/50)","v":106.34999999999988},{"$f":"BS4+(('Management Input'!$C$10-$D$4)/50)","v":107.89999999999988},{"$f":"BT4+(('Management Input'!$C$10-$D$4)/50)","v":109.44999999999987}]
[]
[null,"Basal Area per Stem  (in2)"," ",{"$f":"3.14*(D2/2)^2","v":0.60101562500000005},{"$f":"3.14*(E2/2)^2","v":1.35228515625},2.4040625000000002,3.75634765625,5.409140625,7.3624414062500003,9.6162500000000009,12.17056640625,15.025390625,18.180722656250001,21.6365625,25.39291015625,29.449765625000001,33.80712890625,38.465000000000003,43.423378906250001,48.682265624999999,54.241660156249999,60.1015625,66.261972656250009,72.033340502937833,77.794693643932007,83.501527590932298,89.113044231237566,96.581653962007849,104.35077150527812,112.4203968610484,120.79053002931869,129.46117101008895,138.43231980335923,147.70397640912952,156.43051968425655,165.16333646288544,173.86871382139984,182.51457678206486,191.07075114884648,199.50918492630689,210.60969624833143,222.01071538285592,233.71224232988044,245.71427708940499,258.01681966142951,270.61987004595403,283.52342824297853,296.72749425250305,310.2320680745276,324.03714970905207,336.95720993964716,349.88438812874864,362.79409661291641,375.66253325484416,388.46677992676752,401.18489152676364,413.79597492591864,426.28025738060467,442.43679428181525,458.89383899552587,475.65139152173657,492.70945186044719,510.06802001165778,527.72709597536834,545.68667975157894,563.94677134028962,582.50737074150015,601.36847795521078,{"$f":"3.14*(BQ2/2)^2","v":620.53009298142138},{"$f":"3.14*(BR2/2)^2","v":639.99221582013195},{"$f":"3.14*(BS2/2)^2","v":659.7548464713426},{"$f":"3.14*(BT2/2)^2","v":679.81798493505312},{"$f":"3.14*(BU2/2)^2","v":698.65915438956665}]
[]
[null,"Basal Area per Acre (ft2)"," ",{"$f":"D6*D13/144","v":0.10306532118055556},{"$f":"E6*E13/144","v":0.23189697265624998},0.41226128472222223,0.64415825737847221,0.89002441406249999,1.1602940538194444,1.5154861111111113,1.8335192871093748,2.1592610677083335,2.6127058919270834,3.1093359375,3.6491512044270831,4.2321516927083334,4.85833740234375,5.527708333333333,6.2402644856770833,6.9960058593749999,7.7949324544270819,8.6370442708333339,9.5223413085937505,10.351730055269126,11.179679613796351,5.9998971780899479,6.4031056441663043,6.9397531971000532,7.4979933607108853,8.0778261349987996,8.679251519963799,9.3022695156058788,9.9468801219250462,10.613083338921296,11.240118123571156,11.867603682919913,12.49311761726895,13.114355219459592,6.8645741803050706,7.1677406999459743,7.5665473354523822,7.9761502762973322,8.3965495224808233,8.8277450740028556,9.2697369308634325,9.7225250930625489,10.186109560600206,10.660490333476407,11.145667411691148,11.641640795244429,12.105818129209261,12.570251189149344,13.034056617258264,13.496379277225479,13.956395792437013,14.413317744052518,7.433197253664992,7.6574578547323746,7.947684761227336,8.2433098203915662,8.5443330322250723,8.8507543967278455,9.1625739138998892,9.4797915837412035,9.8024074062517901,10.130421381431647,10.463833509280773,10.802643789799172,{"$f":"BQ6*BQ13/144","v":11.146852222986842},{"$f":"BR6*BR13/144","v":11.49645880884378},{"$f":"BS6*BS13/144","v":11.851463547369994},{"$f":"BT6*BT13/144","v":12.211866438565472},{"$f":"BU6*BU13/144","v":12.55031856843503}]
[]
[null,"Crown Competition Factor 1",null,{"$f":"((C13*3.14*(0.997*(D2)+2.436)^2)/44000)*100","v":1.9288378630468748},2.4709754431054685,3.0801698021875001,3.7564209402929696,4.4997288574218741,5.0950567071898085,5.6863774479090887,6.5543607691235799,7.1541905785873574,7.728289099351918,8.6883615551761348,9.7046287001985068,10.777090534419033,11.905747057837711,13.090598270454542,14.331644172269527,15.628884763282672,16.982320043493964,18.391950012903411,19.85777467151101,21.218037737592596,22.564918571767585,23.889381169788376,12.591640617542033,13.446869015582521,14.330194758222085,15.241617845460729,16.181138277298444,17.148756053735241,18.144471174771109,19.168283640406063,20.127461802828588,{"$f":"((AI13*3.14*(0.997*(AJ2)+2.436)^2)/44000)*100","v":21.083382388409579},22.032676943105166,22.972167381891648,23.898888588736561,12.405053585523227,13.002458362882274,13.613911812540854,14.239413934498977,14.878964728756634,15.532564195313833,16.200212334170569,16.881909145326844,17.577654628782653,18.287448784538007,19.011291612592895,19.687229488967066,20.362172380839556,21.034913122143426,21.704288015608135,22.369181177572422,23.028528447415233,23.681320830175949,12.163303723984189,12.580190139077448,13.004100890320478,13.435035977713275,13.872995401255844,14.31797916094818,14.769987256790284,15.229019688782156,15.695076456923804,16.168157561215214,{"$f":"((BO13*3.14*(0.997*(BP2)+2.436)^2)/44000)*100","v":16.648263001656396},17.135392778247351,17.629546890988067,18.130725339878556,18.638928124918817,19.115654471533006]
{"$rows_left_out":123}
{"sheet":"Chemical costs","index":4,"n_rows":16,"n_cols":85,"rows_kept":16,"cut":false,"hidden":true,"merged":[]}
["Name","Low App Rate/ac","Hi App Rate/ac","Ave Rate","unit","cost ","unit","cost/acre",null,null,null,null,null,null,null,null,null,null,null,null,null,null,null,null,null,null,null,null,null,null,null,null,null,null,null,null,null,null,null,null,null,null,null,null,null,null,null,null,null,null,null,null,null,null,null,null,null,null,null,null,null,null,null,null,null,null,null,null,null,null,null,null,null,null,null,null,null,null,null,null,null,"oz","pt","qt","gal"]
["Asana XL",4.8,14.5,{"$f":"AVERAGE(B2:C2)","v":9.65},"oz",98.2,"gal",{"$f":"D2*(HLOOKUP(E2,$CD$1:$CG$5,IF(G2=\"oz\", 2, IF(G2=\"pt\",3, IF(G2=\"qt\", 4,5)))))*F2","v":7.4038331900000003},null,null,null,null,null,null,null,null,null,null,null,null,null,null,null,null,null,null,null,null,null,null,null,null,null,null,null,null,null,null,null,null,null,null,null,null,null,null,null,null,null,null,null,null,null,null,null,null,null,null,null,null,null,null,null,null,null,null,null,null,null,null,null,null,null,null,null,null,null,null,null,null,"oz",1,16,32,128]
["Confirm 2F",8,16,{"$f":"AVERAGE(B3:C3)","v":12},"oz",null,null,{"$f":"D3*(HLOOKUP(E3,$CD$1:$CG$5,IF(G3=\"oz\", 2, IF(G3=\"pt\",3, IF(G3=\"qt\", 4,5)))))*F3","v":0},null,null,null,null,null,null,null,null,null,null,null,null,null,null,null,null,null,null,null,null,null,null,null,null,null,null,null,null,null,null,null,null,null,null,null,null,null,null,null,null,null,null,null,null,null,null,null,null,null,null,null,null,null,null,null,null,null,null,null,null,null,null,null,null,null,null,null,null,null,null,null,null,"pt",6.25E-2,1,2,8]
["Lorsban 4E/Nufos 4E",1.4,5,3.2,"pt",37.4,"gal",14.96,null,null,null,null,null,null,null,null,null,null,null,null,null,null,null,null,null,null,null,null,null,null,null,null,null,null,null,null,null,null,null,null,null,null,null,null,null,null,null,null,null,null,null,null,null,null,null,null,null,null,null,null,null,null,null,null,null,null,null,null,null,null,null,null,null,null,null,null,null,null,null,null,"qt",3.1199999999999999E-2,0.5,1,4]
["Warrior",2.56,5.12,3.84,"oz",2.23,"oz",8.5632000000000001,null,null,null,null,null,null,null,null,null,null,null,null,null,null,null,null,null,null,null,null,null,null,null,null,null,null,null,null,null,null,null,null,null,null,null,null,null,null,null,null,null,null,null,null,null,null,null,null,null,null,null,null,null,null,null,null,null,null,null,null,null,null,null,null,null,null,null,null,null,null,null,null,"gal",7.8130000000000005E-3,0.125,0.25,1]
["Imidian 70WSB",1,3.125,2.0625,"pt",8.92,"pt",{"$f":"D6*F6","v":18.397500000000001}]
["Sevin 80W",2.5,6.25,4.375,"pt",7.12,"pt",{"$f":"D7*F7","v":31.150000000000002}]
["Dipel ES",1,4,2.5,"pt",12,"pt",30]
["Javelin WG",0.25,4,2.125,"pt",null,null,0]
["Guthion 2L",6,8,7,"pt",11.6,"pt",81.2,null,null,null,null,null,null,null,null,null,null,null,null,null,null,null,null,null,null,null,null,null,null,null,null,null,null,null,null,null,null,null,null,null,null,null,null,null,null,null,null,null,null,null,null,null,null,null,null,null,null,null,null,null,null,null,null,null,null,null,null,null,null,null,null,null,null,null,null,null,null,null,null,null,"this is read:  Vertical/horizontal"]
{"$rows_left_out":7}
{"sheet":"Nut Price","index":5,"n_rows":28,"n_cols":106,"rows_kept":28,"cut":false,"hidden":false,"merged":[[24,104,26,104],[24,105,26,109],[27,104,29,104],[27,105,29,109],[15,104,17,104],[15,105,17,109],[18,104,20,104],[18,105,20,109],[21,104,23,104],[21,105,23,109],[6,105,8,109],[6,104,8,104],[9,105,11,109],[9,104,11,104],[12,104,14,104],[12,105,14,109],[0,0,1,9],[2,0,2,9],[4,2,4,3],[3,8,3,9],[3,5,4,5],[3,6,4,7]]}
["This table shows how % yield and nut quality affect the total price per pound received by the grower."]
[]
["These prices are for dry in- shell nuts delivered to the Hammons Plant in Stockton, Missouri."]
[null,null,null,null,null,"Somewhat shriveled or off- color nutmeats","Somewhat variable color nutmeats or veins present",null,"Light colored, uniform, plump kernels,"]
[null,null,"Dark or shriveled nutmeats",null,null,null,null,null," Minimal veins","No veins"]
[null,"$ / POINT --->",0.01,1.2E-2,1.4E-2,1.6E-2,1.7999999999999999E-2,0.02,2.1999999999999999E-2,2.4E-2]
["% YIELD",null,null,null,null,null,null,null,null,null,null,null,null,null,null,null,null,null,null,null,null,null,null,null,null,null,null,null,null,null,null,null,null,null,null,null,null,null,null,null,null,null,null,null,null,null,null,null,null,null,null,null,null,null,null,null,null,null,null,null,null,null,null,null,null,null,null,null,null,null,null,null,null,null,null,null,null,null,null,null,null,null,null,null,null,null,null,null,null,null,null,null,null,null,null,null,null,null,null,null,null,null,null,null,"Grade 1","Highest Quality: Light colored, uniform, plump kernel, good natural aroma"]
[16,null,{"$f":"C$6*$A8","v":0.16},0.192,0.224,0.25600000000000001,0.28799999999999998,0.32,0.35199999999999998,0.38400000000000001,null,null,null,null,null,null,null,null,null,null,null,null,null,null,null,null,null,null,null,null,null,null,null,null,null,null,null,null,null,null,null,null,null,null,null,null,null,null,null,null,null,null,null,null,null,null,null,null,null,null,null,null,null,null,null,null,null,null,null,null,null,null,null,null,null,null,null,null,{"$f":"A8/100","v":0.16}]
[18,null,0.18,0.216,0.252,0.28800000000000003,0.32399999999999995,0.36,0.39599999999999996,0.432,null,null,null,null,null,null,null,null,null,null,null,null,null,null,null,null,null,null,null,null,null,null,null,null,null,null,null,null,null,null,null,null,null,null,null,null,null,null,null,null,null,null,null,null,null,null,null,null,null,null,null,null,null,null,null,null,null,null,null,null,null,null,null,null,null,null,null,null,{"$f":"A9/100","v":0.18}]
[20,null,0.2,0.24,0.28000000000000003,0.32,0.36,0.4,0.43999999999999995,0.48,null,null,null,null,null,null,null,null,null,null,null,null,null,null,null,null,null,null,null,null,null,null,null,null,null,null,null,null,null,null,null,null,null,null,null,null,null,null,null,null,null,null,null,null,null,null,null,null,null,null,null,null,null,null,null,null,null,null,null,null,null,null,null,null,null,null,null,null,0.2,null,null,null,null,null,null,null,null,null,null,null,null,null,null,null,null,null,null,null,null,null,null,null,null,null,"Grade 2","High Quality: Light colored, uniform, plump kernel, minimal veins"]
{"$rows_left_out":18}